Npm Codice Errore Elifecycle Errno 2 :: mangxahoi24h.com
Immagine Di Sfondo Alta Sierra | Connectify Dispatch 2018 Crack | File Di Download Di Python Urllib3 | Smith College Microsoft Office | Macbook Air 2017 Funziona Lentamente | Scarica Visual Fortran In Pgi | Migliori Pacchetti Atomici | Cerchi Cromati | Download Gratuito Di Jukebox Clipart

npm install error - error code ELIFECYCLE – IDEs.

I would suggest submitting this at StackOverflow for a bigger audience out there. Not what you're looking for? Search community questions.

09/12/2019 · JavaScript for WordPress › Forums › Bugs & Issues › npm ERR! code ELIFECYCLE on Terminal This topic has 6 replies, 2 voices, and was last updated 3 weeks, 3 days ago by Zac Gordon. Viewing 7 posts - 1 through 7 of 7 total Author Posts December 6, 2019 at 7:41 pm 127761 dareadelParticipant []. Whenever I try to run "npm run build" command on my CMD i get this error: npm ERR! code ELIFECYCLE npm ERR! errno 1 npm ERR! webpacktest@1.0.0 build: webpack --progress --watch npm ERR! Exit status 1 npm ERR! npm ERR! Failed at the webpacktest@1.0.0 build script. npm ERR! This is probably not a problem with npm. I created a new ADF application from scratch. I can not start it. Will output error: > alfresco@0.1.0 start /home/user/alfresco > npm run. npm ERR! A complete log of this run can be found in: npm ERR! C:\Users\LONOVO\AppData\Roaming\npm-cache_logs\2019-02-18T16_27_37_768Z-debug.log npm ERR! code ELIFECYCLE npm ERR! errno 2 npm ERR! @ dev: npm run development npm ERR! Exit status 2 npm ERR! npm ERR! Failed at the @ dev script. npm ERR! This is probably not a problem with npm. @sdetweil The RasPi is connected via HDMI to a Display and I’m using VNC to configure it. I had a previous install where everything worked with pm2 and manually using the command “npm start”.

npm ERR! This is probably not a problem with npm. There is likely additional logging output above. The build failed because the process exited too early. This probably means the system ran out of memory or someone called `kill -9` on the process. npm ERR! code ELIFECYCLE npm ERR! errno 1 npm ERR! setup@0.1.0 build: `react-scripts build` npm ERR! Exit status 1 npm ERR! npm ERR! Faile. The most concise screencasts for the working developer, updated daily. There's no shortage of content at Laracasts. In fact, you could watch nonstop for days upon days, and still not see everything! Hallo, bin noch relativ neu was ioBroker angeht aber habe es einfach mal auf meinen Raspberry gepackt und wollte so mit Alexa ein paar Sachen steuern. Nun habe ich versucht JS zu installieren und leider diesen Fehler bekommen: root@Nas-Server:~ npm insta.

I've looked at several similar questions, but none of the answers solved my problem. The problem is, I'm trying to run an express server, and I don't mess with it, I just need middleware to. npm ERR! code ELIFECYCLE npm ERR! errno 1 npm ERR! ilm-mobileweb-nightwatchjs@1. 0.0 e2e-test: `nightwatch` npm ERR! Exit status 1 npm ERR! npm ERR! Failed at the ilm-mobileweb-nightwatchjs@1. 0.0 e2e-test script. npm ERR! This is probably not a problem with npm. There is likely additional logging output above. npm ERR! A complete log of this. Press J to jump to the feed. Press question mark to learn the rest of the keyboard shortcuts. npm ERR! code ELIFECYCLE npm ERR! errno 1 npm ERR! angular-project@0.0.0 packagr: `ng-packagr -p ng-package.json` npm ERR! Exit status 1 npm ERR! npm ERR! Failed at the angular-project@0.0.0 packagr script. npm ERR! This is probably not a problem with npm. There is likely additional logging output above.

npm ERR! code ELIFECYCLE npm ERR! errno 1 npm ERR! mbb-vue@1.0.0 build: `node build/build.js` npm ERR! Exit status 1 npm ERR! npm ERR! Failed at the mbb-vue@1.0.0 build script. npm ERR! This is probably not a problem with npm. There is likely additional logging output above. npm ERR! A complete log of this run can be found in: npm ERR! node.js npm ERR! codice ELIFECYCLE. Sto cercando di imparare a reagire, quindi ho questo codice di esempio per l'app di voto di reazione fullstack e sto cercando di farlo funzionare ma dopo aver eseguito npm install seguito da npm start. 23/09/2017 · ※コメント欄のご指摘のとおり、node-jsdomではなくjsdomを利用しましょう! jQueryプラグインのテストコードを書くために、node-jsdomをnpmでインストールしようとしたところエラーになってちょっとハマってしまった 上記の.

npm run build throws error code ELIFECYCLE

24/07/2019 · Hello friends. I'm trying to install Apify for Node.js, but I get an error:babel: src does not exist npm ERR! code ELIFECYCLE npm ERR! errno 2 npm. Your question seems not to be about Ubuntu, but is rather a general programming question. However, if you actually looked at the output, you would have spotted the line Cannot find module 'electron-to-chromium' in there, which clearly indicates that your project is missing the module electron-to. 17/02/2018 · NOTE: If you are using Windows 10, you will want to open an Administrator PowerShell right-click and choose "Run as administrator". Once opened, type "npm install --global windows-build-tools --vs2015" and be prepared to wait for at least 30 minutes. If you're developing NodeJS applications on Windows you may have encountered.

18/01/2018 · What version of npm does that give me? Why should I now have to change environment variables? In my case Node was installed before so it chose the previous version automatically as system default when running npm start. In my case that was 8.9.0 node -v gets you versions of node and npm. When I changed to 6.12.2 it worked for me. Ever since DO changed there one click install for Ghost to cost $10 instead of $5 saying you can't run ghost on a smaller droplet which is total nonsense have a ghost blog running for 2-3 years on a $5 droplet. I can't even manually install ghost on.

npm ERR! code ELIFECYCLE npm ERR! errno 2 npm ERR! magicmirror@2.6.0 start: sh run-start.sh npm ERR! Exit status 2 npm ERR! npm ERR! Failed at the magicmirror@2.6.0 start script. npm ERR! This is probably not a problem with npm. There is likely additional logging output above. npm ERR! A complete log of this run can be found in: npm ERR! I've just moved my development environment over to Fedora. I've installed Node and NPM properly, but my run script isn't working. It exits immediately with errno 1 and no extra output. hi team, can somebody help with npm run build issue ? also, i declared splunk_home varialble and this result is after. 0 info it worked if it ends with ok.

28/02/2017 · Make sure you have the latest version of node.js and npm installed. npm ERR! If you do, this is most likely a problem with the webpack-treehouse-example p npm ERR! not with npm itself. npm ERR! Tell the author that this fails on your system: npm ERR! webpack-dev-server npm ERR! You can get information on how to open an issue for this project. sh: 1: node-pre-gyp: Permission denied npm ERR! code ELIFECYCLE npm ERR! errno 126 npm ERR! sqlite3@4.1.0 install: `node-pre-gyp install --fallback-to-build` npm ERR! Exit status 126 npm ERR! npm ERR! Failed at the sqlite3@4.1.0 install script. npm ERR! This is probably not a problem with npm. There is likely additional logging output above. 16/09/2019 · I would try and go through the first part of the video setting up the index.js and what not again, can not tell by your code but it has to be something you did wrong setting up.

Modelli Di Invito Modificabili Per Microsoft Word
Rilascio Progressivo Dell'edizione Debian Di Linux Per Linux
Lion Candy Bar Bianco
Esempio Di Utilizzo Della Sequenza Oracle
Download Gratuito Di Exagear Apk
MS Office 16 Professional Plus
Freno A Mano Linux Vs Windows
Sql Se La Tabella Esiste Drop Oracle
Sirf Tum Mp3 Hindi Mobi
Uomini Capelli Ricci E Mossi
Orologio Tornado Attivo
Stampante Fotografica Hp Mini
Due Falegnami Mp3 Online
Rm Tutto In Linux
Durata Della Batteria Jbl Duet Nc
Service Pack 3 Wincc Flexible 2008
Configurazione Wireless Della Stampante Pixma Ip110
Quiz Sql E Plsql
Elenco Aziende Sigma Soft Tech Park
I Migliori Smartphone Android In Arrivo
Benchmark Y6 2020
Migliore App Di Comunicazione Video
Jbl Partybox 300 Vs Bose S1 Pro
Scarica Visual Basic.net Gratuitamente
Timer Sulla Schermata Di Blocco
Scarica Il Video Del Contenitore
Molte Grazie Clipart
S Driver Del Modem Hsdpa
Trama Numpy.random.normal
Microsoft 365 Non Funziona Con Windows 10
Download Di Dj Apps 2020
Solr Yum Install
Recensione Di Windows Phone Launcher
Miglior Vgod Mech Mod
Comprare Epson Expression 11000xl
Adp Vantage Hcm App
Ms Dos Floppy Image
Driver Kinivo Bluetooth Windows 7
IPad 11
Un Nuovo Aggiornamento IOS È Ora Disponibile Correzione
/
sitemap 0
sitemap 1
sitemap 2
sitemap 3
sitemap 4
sitemap 5
sitemap 6
sitemap 7
sitemap 8
sitemap 9
sitemap 10
sitemap 11
sitemap 12
sitemap 13
sitemap 14
sitemap 15
sitemap 16
sitemap 17
sitemap 18